Обнаружение ошибок в модуле в горном льве

Я пытаюсь установить SciPy на мою Mac OS 10.8.2 для Python 2.7.2. У меня обновлен XCode 4.6 и установлены средства командной строки. Я установил numpy с помощью pip, как предложено в этом потоке Установка Numpy на Mac 10.8.2 , и я использую компиляторы Fortran с веб-сайта High Performance Computing for Mac ( http://hpc.sourceforge.net/).

Я могу получить numpy для установки, но когда я пытаюсь запустить встроенный модульный тест SciPy (как это предлагается в документации по установке SciPy здесь ) Я продолжаю получать FAIL для тестов основных арифметических функций.

Любые предложения будут высоко ценится.

Python 2.7.2 (default, Jun 20 2012, 16:23:33) 
[GCC 4.2.1 Compatible Apple Clang 4.0 (tags/Apple/clang-418.0.60)] on darwin
Type "help", "copyright", "credits" or "license" for more information.
>>> import numpy as np
>>> np.test('full')
Running unit tests for numpy
NumPy version 1.6.1
NumPy is installed in /System/Library/Frameworks/Python.framework/Versions/2.7/Extras/lib/python/numpy
Python version 2.7.2 (default, Jun 20 2012, 16:23:33) [GCC 4.2.1 Compatible Apple Clang 4.0 (tags/Apple/clang-418.0.60)]
nose version 1.2.1
..................................................................................................................................................................................................................................................................................................................................................................................................................................................................................................................................................................F............................................................................................................................................................................................................................................................................................................................................................................................................................K.................................................................................................K......................K..................................................................................................................................................................................................................................................................................................................................................................................................................................................................................F..............................................................................................................................................................................................................................................................................................................................................................................................................................................................................................................................................................................................................................................................................................................................................................................................................................................................................................................................................................................................................................................................................................................................S.....................................................................................................................................................................................................................................................................................................................................................................................................................................................................................................................................................................................................................................................................................................................................................................................................................................................................................................................................................
======================================================================
FAIL: Test basic arithmetic function errors
----------------------------------------------------------------------
Traceback (most recent call last):
  File "/System/Library/Frameworks/Python.framework/Versions/2.7/Extras/lib/python/numpy/testing/decorators.py", line 215, in knownfailer
    return f(*args, **kwargs)
  File "/System/Library/Frameworks/Python.framework/Versions/2.7/Extras/lib/python/numpy/core/tests/test_numeric.py", line 321, in test_floating_exceptions
    lambda a,b:a/b, ft_tiny, ft_max)
  File "/System/Library/Frameworks/Python.framework/Versions/2.7/Extras/lib/python/numpy/core/tests/test_numeric.py", line 271, in assert_raises_fpe
    "Type %s did not raise fpe error '%s'." % (ftype, fpeerr))
  File "/System/Library/Frameworks/Python.framework/Versions/2.7/Extras/lib/python/numpy/testing/utils.py", line 34, in assert_
    raise AssertionError(msg)
AssertionError: Type  did not raise fpe error ''.

======================================================================
FAIL: test_kind.TestKind.test_all
----------------------------------------------------------------------
Traceback (most recent call last):
  File "/Library/Python/2.7/site-packages/nose/case.py", line 197, in runTest
    self.test(*self.arg)
  File "/System/Library/Frameworks/Python.framework/Versions/2.7/Extras/lib/python/numpy/f2py/tests/test_kind.py", line 30, in test_all
    'selectedrealkind(%s): expected %r but got %r' %  (i, selected_real_kind(i), selectedrealkind(i)))
  File "/System/Library/Frameworks/Python.framework/Versions/2.7/Extras/lib/python/numpy/testing/utils.py", line 34, in assert_
    raise AssertionError(msg)
AssertionError: selectedrealkind(19): expected -1 but got 16

----------------------------------------------------------------------
Ran 3552 tests in 35.919s

FAILED (KNOWNFAIL=3, SKIP=1, failures=2)

>>> 

Связанные темы предложили использовать скрипт установки SciPy Superpack от Chris Fonnesbeck, но это, похоже, построено для OS 10.7.

Моя версия gcc - 4.2.1, а моя версия gfortran - 4.8.0

Заранее спасибо.

1
nl ja de
Я бы связался с Numpy, а также попробовал дистрибутив Python для OsX от Enthought под названием EPD. Это работает для меня, и это была простая установка. epd-free.enthought.com/?Download=Download+ EPD + Free + 7.3-2
добавлено автор reptilicus, источник
Добро пожаловать в stackoverflow. Вы пытались связаться с командой numpy об этом?
добавлено автор Simon, источник
Была ли установка EPD, и теперь Numpy работает нормально! Большое спасибо за Вашу помощь.
добавлено автор batpigandme, источник
Python
Python
7 654 участник(ов)

Уютный чат для профессионалов, занимающихся поиском питоньих мудростей. Как не получить бан: https://t.me/ru_python/577926

QA — вакансии и аналитика рынка вакансий
QA — вакансии и аналитика рынка вакансий
5 668 участник(ов)

Вакансии и поиск работы в сфере QA. Вопросы: @qa_ru Про деньги: @qa_fin При размещении вакансии указывать: - должность - компанию - требования к кандидату - условия и ЗП хэштеги: #город #типзанятости

Python beginners
Python beginners
4 449 участник(ов)

Вопросы про Python для чайников. Cпам и троллинг неприемлем. Не злоупотребляйте стикерами. Частозадаваемые вопросы: https://github.com/ru-python-beginners/faq/blob/master/README.md Статистика тут: https://grstats.me/chat/x4qym2k5uvfkr3al6at7

QA — русскоговорящее сообщество
QA — русскоговорящее сообщество
3 625 участник(ов)

Общаемся про все виды тестирования и его автоматизацию. Без мата, грубостей и провокаций. События: @qaevents Вакансии: @qa_jobs Автоматизаторы: @qa_automation Слухи про компании: @qa_bad_company

QA juniors
QA juniors
2 720 участник(ов)

Добро пожаловать в чат джуниоров QA! Общаемся обо всём, что связано с тестированием и не только :) В чате царит дружественная атмосфера, поэтому общаемся без мата, грубостей. @qa_automation - автоматизация @serious_tester - для тестировщиков и QA

QA - Bad Company!
QA - Bad Company!
2 602 участник(ов)

Позитив и негатив про компании или курсы, куда не стоит идти работать или учиться, а куда стоит. За пиратский контент - бан. @qa_fin о деньгах Русскоговорящее сообщество: @qa_ru Флудилка: @qaFlood Вакансии: @qa_jobs Финансы: @qa_fin

QA — Автоматизация
QA — Автоматизация
2 434 участник(ов)

1. Обсуждение технологий автоматизированного тестирования 2. Помощь начинающим Ru-сообщество: @qa_ru Джуночат: @qajuniors Вакансии: @qa_jobs Финансы: @qa_fin Митапы и события: @qaevents Паблики: @serious_tester, @automation_remarks, @atinfo

QA - Finance
QA - Finance
1 347 участник(ов)

Чат о деньгах тестировщиков. ЗП, релокейты,оферы. @qa_bad_company - обсуждение компаний/курсов и карьерного роста для QA @qa_automation - авто QA Холивары, политика, религия-бан Реклама, спам, оскорбления - бан Для флуда используйте другой чат

pro.python
pro.python
1 090 участник(ов)

Сообщество разработчиков под Python Создатель: @rodgelius

Rude Python
Rude Python
971 участник(ов)

Python без „девочек”, здесь матерятся и унижают Django. Not gay friendly. Правила: t.me/rudepython/114107 @rudepython | t.me/rudepython

rupython
rupython
509 участник(ов)

Группа создана с целью оперативного получения ответов на возникающие вопросы по разработке на яп python, смежные темы, а также человеческого общения. Приветствую!

Python-programming
Python-programming
266 участник(ов)

Чат группы вконтакте https://vk.com/python_community